Target
Genome polyprotein
Ligand
BDBM204547
Substrate
Meas. Tech.
Inhbition Assay
IC50
34±n/a nM
Citation
 He, SDai, XPalani, ANargund, RLai, ZZorn, NXiao, DDang, QMcComas, CCLi, PPeng, XSoll, R Tetracyclic heterocycle compounds and methods of use thereof for the treatment of hepatitis C US Patent  US9242998 Publication Date 1/26/2016 
Target
Name:
Genome polyprotein
Synonyms:
HCV Polymerase (S282T) NS3/4A Protein POLG_HCVJA
Type:
Protein
Mol. Mass.:
327076.78
Organism:
Hepatitis C Virus (Virus)
Description:
P26662
Residue:
3010
  
Inhibitor
Name:
BDBM204547
Synonyms:
US9242998, 27
Type:
Small organic molecule
Emp. Form.:
C37H27F2N5O6S
Mol. Mass.:
707.702
SMILES:
CNC(=O)c1c(oc2cc(N(C)S(C)(=O)=O)c(cc12)-c1ccc2OCn3c(cc4c(F)cccc34)-c2n1)-c1ccc(Oc2ccc(F)cc2)nc1
: