Target
Genome polyprotein
Ligand
BDBM204785
Substrate
Meas. Tech.
Inhibition Assay
IC50
1.488±n/a nM
Citation
 Dai, XLiu, HPalani, AHe, SBrockunier, LLNargund, RMarcantonio, KZorn, NXiao, DPeng, XLi, PGuo, T Tetracyclic heterocycle compounds and methods of use thereof for the treatment of hepatitis C US Patent  US9243002 Publication Date 1/26/2016 
Target
Name:
Genome polyprotein
Synonyms:
Dipeptidyl peptidase 4 (DPP4) NS3 NS5B NS3-4A Protease NS3/4A protease POLG_HCV77 | RNA polymerase (NS5B)
Type:
Protease Domain
Mol. Mass.:
327221.49
Organism:
Hepatitis C virus (HCV genotype 1a, isolate H)
Description:
P27958
Residue:
3011
  
Inhibitor
Name:
BDBM204785
Synonyms:
US9243002, 83 | US9243002, 86
Type:
Small organic molecule
Emp. Form.:
C34H24FN5O4S
Mol. Mass.:
617.649
SMILES:
CNC(=O)c1c(oc2cc(N(C)S(C)(=O)=O)c(cc12)-c1ccc2ccn3c4cccc(C#N)c4cc3c2n1)-c1ccc(F)cc1
: