Target
Cyclin-dependent kinase/G2/mitotic-specific cyclin- 1
Ligand
BDBM5776
Substrate
Histone H1
Meas. Tech.
Kinase Inhibition assay
pH
8±n/a
Temperature
303.15±n/a K
IC50
6±n/a nM
Citation
 Misra, RNXiao, HRawlins, DBShan, WKellar, KAMulheron, JGSack, JSTokarski, JSKimball, SDWebster, KR 1H-Pyrazolo[3,4-b]pyridine inhibitors of cyclin-dependent kinases: highly potent 2,6-Difluorophenacyl analogues. Bioorg Med Chem Lett 13:2405-8 (2003)  
Target
Name:
Cyclin-dependent kinase/G2/mitotic-specific cyclin- 1
Synonyms:
CDK1/B CDK1/CyclinB Cyclin-Dependent Kinase 1 (CDK1) Cyclin-dependent kinase/G2/mitotic-specific cyclin 1 | cdk1
Type:
Protein Complex
Mol. Mass.:
Description:
CDK1/Cyclin B complexes were purified from insect cells co-infected with baculovirus vectors containing each of the components.
Components:
This complex has 2 components.
Component 1
Name:
Cyclin-dependent kinase 1
Synonyms:
CDC2 CDK1 CDKN1 Cell division protein kinase 1 P34CDC2 | p34 protein kinase
Type:
Enzyme Subunit
Mol. Mass.:
34101.08
Organism:
Homo sapiens (Human)
Description:
P06493
Residue:
297
  
Component 2
Name:
G2/mitotic-specific cyclin-B1
Synonyms:
CCNB CCNB1_HUMAN
Type:
Enzyme Subunit
Mol. Mass.:
48340.95
Organism:
Homo sapiens (Human)
Description:
P14635
Residue:
433
  
Inhibitor
Name:
BDBM5776
Synonyms:
4-butoxy-5-[(2,6-difluoro-4-methylphenyl)carbonyl]-1H-pyrazolo[3,4-b]pyridine pyrazolo[3,4-b]pyridine deriv.
Type:
Small organic molecule
Emp. Form.:
C18H17F2N3O2
Mol. Mass.:
345.3433
SMILES:
CCCCOc1c(cnc2[nH]ncc12)C(=O)c1c(F)cc(C)cc1F
:
Substrate
Name:
Histone H1
Synonyms:
Type:
Other Protein Type
Mol. Mass.:
358.43
Organism:
Bos taurus (bovine)
Description:
25 uM ATP/0.2 uCi[gamma-33P] as co-substrate.
Residue:
3
NA