Target
Bcl-2-like protein 1 [1-209]
Ligand
BDBM156377
Substrate
Meas. Tech.
Fluorescence Polarization Assay
pH
7.5±n/a
IC50
1±n/a nM
Comments
extracted
Citation
 Diebold, RBGero, TWGrover, PHuang, SIoannidis, SOgoe, CASaeh, JC Chemical compounds US Patent  US9248140 Publication Date 2/2/2016 
Target
Name:
Bcl-2-like protein 1 [1-209]
Synonyms:
Apoptosis regulator Bcl-XL BCL2L BCLX
Type:
Protein
Mol. Mass.:
23354.38
Organism:
Homo sapiens (Human)
Description:
C-terminal 6XHIS tagged Bcl-XL (aa 1-209)
Residue:
209
  
Inhibitor
Name:
BDBM156377
Synonyms:
US9018381, 2 | US9248140, 2
Type:
Small organic molecule
Emp. Form.:
C43H46ClN5O6S2
Mol. Mass.:
828.438
SMILES:
CN(C)CC[C@H](CSc1ccccc1)Nc1ccc(cc1[N+]([O-])=O)S(=O)(=O)NC(=O)c1ccc(cc1)N1CCC(CC1)[C@@H](O)c1ccccc1-c1ccc(Cl)cc1
: