Target
Cystic fibrosis transmembrane conductance regulator [1-507,509-1480]
Ligand
BDBM160537
Substrate
Meas. Tech.
CFTR-YFP Assay
EC50
<10000±n/a nM
Citation
 Cole, BM Phthalazinone compounds and methods for the treatment of cystic fibrosis US Patent  US9682969 Publication Date 6/20/2017 
Target
Name:
Cystic fibrosis transmembrane conductance regulator [1-507,509-1480]
Synonyms:
ABCC7 CFTR F508del CFTR_HUMAN | Cystic fibrosis transmembrane conductance regulator (aa 1-507, aa 509-1480)
Type:
Protein
Mol. Mass.:
168024.13
Organism:
Homo sapiens (Human)
Description:
Human CTFR variant with F508 deletion.
Residue:
1479
  
Inhibitor
Name:
BDBM160537
Synonyms:
US10280160, Example 29. | US9682969, 29
Type:
Small organic molecule
Emp. Form.:
C30H27ClN4O5
Mol. Mass.:
559.012
SMILES:
CN(C(=O)Cn1nc(-c2cccc(Cl)c2)c2ccc(OC3CCOCC3)cc2c1=O)c1ccc2nc(C)oc2c1
: