Target
Baculoviral IAP repeat-containing protein 3 [256-363]
Ligand
BDBM205382
Substrate
Meas. Tech.
DELFIA Assay
Temperature
298.15±n/a K
IC50
31±n/a nM
Comments
extracted
Citation
 Reiser, U Bis-amido pyridines US Patent  US9249151 Publication Date 2/2/2016 
Target
Name:
Baculoviral IAP repeat-containing protein 3 [256-363]
Synonyms:
API2 BIRC3_HUMAN MIHC | RNF49
Type:
Protein
Mol. Mass.:
12303.07
Organism:
Homo sapiens (Human)
Description:
BIR3 domain of human cIAP1 (256-363 aa)
Residue:
108
  
Inhibitor
Name:
BDBM205382
Synonyms:
US9249151, 28
Type:
Small organic molecule
Emp. Form.:
C27H26N6O3
Mol. Mass.:
482.5337
SMILES:
CNC(C)C(=O)Nc1cc(cc(NC(=O)c2cc3COCc3cn2)n1)-c1c(C)ccc2ncccc12
: