Target
Bromodomain-containing protein 3 [24-144,306-416]
Ligand
BDBM205429
Substrate
Meas. Tech.
Bromodomains Assay for DiscoveRx Gene Symbol
Kd
14±0.0 nM
Citation
 Tanaka, MRoberts, JMSeo, HSSouza, APaulk, JScott, TGDeAngelo, SLDhe-Paganon, SBradner, JE Design and characterization of bivalent BET inhibitors. Nat Chem Biol 12:1089-1096 (2016)  
Target
Name:
Bromodomain-containing protein 3 [24-144,306-416]
Synonyms:
BET bromodomain 3(1,2) (BRD3(1,2)) BRD3_HUMAN RING3L
Type:
Mol. Mass.:
27406.43
Organism:
Homo sapiens (Human)
Description:
Q15059 (BRD3, 24-144) and 306-416)
Residue:
232
  
Inhibitor
Name:
BDBM205429
Synonyms:
(R)-JQ1 (3) US10925881, Name (R)-JQ1 US11117865, Compound JQ1 US11406645, Compound JQ1 US9320741, (R)-JQ1
Type:
Small organic molecule
Emp. Form.:
C23H25ClN4O2S
Mol. Mass.:
456.988
SMILES:
Cc1nnc2[C@@H](CC(=O)OC(C)(C)C)N=C(c3c(C)c(C)sc3-n12)c1ccc(Cl)cc1
: