Target
Bromodomain-containing protein 2 [348-455]
Ligand
BDBM205431
Substrate
Meas. Tech.
Bromodomains Assay for DiscoveRx Gene Symbol
Ki
0.0069±0.0 nM
Citation
 Tanaka, MRoberts, JMSeo, HSSouza, APaulk, JScott, TGDeAngelo, SLDhe-Paganon, SBradner, JE Design and characterization of bivalent BET inhibitors. Nat Chem Biol 12:1089-1096 (2016)  
Target
Name:
Bromodomain-containing protein 2 [348-455]
Synonyms:
BET bromodomain 2(2) (BRD2(2)) BRD2-BD2 Bromodomain-containing protein 2 (aa 348-455) RING3
Type:
Mol. Mass.:
12751.52
Organism:
Homo sapiens (Human)
Description:
P25440[348-455]
Residue:
108
  
Inhibitor
Name:
BDBM205431
Synonyms:
(6S+2S)-PEG1 (7)
Type:
Small organic molecule
Emp. Form.:
C43H42Cl2N10O5S2
Mol. Mass.:
913.894
SMILES:
COC(=O)C[C@@H]1N=C(c2c(C)c(sc2-n2c(C)nnc12)C(=O)NCCOCCNC(=O)C[C@@H]1N=C(c2c(C)c(C)sc2-n2c(C)nnc12)c1ccc(Cl)cc1)c1ccc(Cl)cc1
: