Target
Bromodomain-containing protein 4 [333-460]
Ligand
BDBM205431
Substrate
Meas. Tech.
Bromodomains Assay for DiscoveRx Gene Symbol
Ki
0.0043±0.0 nM
Citation
 Tanaka, MRoberts, JMSeo, HSSouza, APaulk, JScott, TGDeAngelo, SLDhe-Paganon, SBradner, JE Design and characterization of bivalent BET inhibitors. Nat Chem Biol 12:1089-1096 (2016)  
Target
Name:
Bromodomain-containing protein 4 [333-460]
Synonyms:
BET bromodomain 4(2) (BRD4(2)) BRD4_HUMAN HUNK1
Type:
Enzyme Catalytic Domain
Mol. Mass.:
14818.38
Organism:
Homo sapiens (Human)
Description:
aa (333-460)
Residue:
128
  
Inhibitor
Name:
BDBM205431
Synonyms:
(6S+2S)-PEG1 (7)
Type:
Small organic molecule
Emp. Form.:
C43H42Cl2N10O5S2
Mol. Mass.:
913.894
SMILES:
COC(=O)C[C@@H]1N=C(c2c(C)c(sc2-n2c(C)nnc12)C(=O)NCCOCCNC(=O)C[C@@H]1N=C(c2c(C)c(C)sc2-n2c(C)nnc12)c1ccc(Cl)cc1)c1ccc(Cl)cc1
: