Target
Bromodomain-containing protein 4 [44-168]
Ligand
BDBM205431
Substrate
Meas. Tech.
BROMOscan Assay
Kd
0.01±0.0 nM
Citation
 Tanaka, MRoberts, JMSeo, HSSouza, APaulk, JScott, TGDeAngelo, SLDhe-Paganon, SBradner, JE Design and characterization of bivalent BET inhibitors. Nat Chem Biol 12:1089-1096 (2016)  
Target
Name:
Bromodomain-containing protein 4 [44-168]
Synonyms:
BET bromodomain 4(1) (BRD4(1)) BRD4-BD1 protein (aa 44-168) Bromodomain protein 4 (BRD4-BD1) Bromodomain-containing protein 4 (BRD4) (aa 44-168) Bromodomain-containing protein 4 bromodomain 1 (BRD4-BD1) | HUNK1
Type:
Enzyme Catalytic Domain
Mol. Mass.:
14866.49
Organism:
Homo sapiens (Human)
Description:
aa (44-168)
Residue:
125
  
Inhibitor
Name:
BDBM205431
Synonyms:
(6S+2S)-PEG1 (7)
Type:
Small organic molecule
Emp. Form.:
C43H42Cl2N10O5S2
Mol. Mass.:
913.894
SMILES:
COC(=O)C[C@@H]1N=C(c2c(C)c(sc2-n2c(C)nnc12)C(=O)NCCOCCNC(=O)C[C@@H]1N=C(c2c(C)c(C)sc2-n2c(C)nnc12)c1ccc(Cl)cc1)c1ccc(Cl)cc1
: