Target
Bromodomain testis-specific protein [21-137]
Ligand
BDBM205434
Substrate
Meas. Tech.
AlphaScreen BRD Binding Assay
pH
7.5±n/a
Temperature
298.15±n/a K
IC50
1.09±0.0 nM
Comments
extracted
Citation
 Tanaka, MRoberts, JMSeo, HSSouza, APaulk, JScott, TGDeAngelo, SLDhe-Paganon, SBradner, JE Design and characterization of bivalent BET inhibitors. Nat Chem Biol 12:1089-1096 (2016)  
Target
Name:
Bromodomain testis-specific protein [21-137]
Synonyms:
BRDT Bromodomain testis 1 (BRDT(1))
Type:
Mol. Mass.:
13934.55
Organism:
Homo sapiens (Human)
Description:
Q58F21 (BRDT, 21-137)
Residue:
117
  
Inhibitor
Name:
BDBM205434
Synonyms:
(6S+2S)-PEG4 (10)
Type:
Small organic molecule
Emp. Form.:
C49H54Cl2N10O8S2
Mol. Mass.:
1046.051
SMILES:
COC(=O)C[C@@H]1N=C(c2c(C)c(sc2-n2c(C)nnc12)C(=O)NCCOCCOCCOCCOCCNC(=O)C[C@@H]1N=C(c2c(C)c(C)sc2-n2c(C)nnc12)c1ccc(Cl)cc1)c1ccc(Cl)cc1
: