Target
Anthranilate--CoA ligase
Ligand
BDBM205460
Substrate
Meas. Tech.
PqsA Spectrophotometric Assay
pH
8±n/a
Ki
88±12 nM
Comments
extracted
Citation
 Ji, CSharma, IPratihar, DHudson, LLMaura, DGuney, TRahme, LGPesci, ECColeman, JPTan, DS Designed Small-Molecule Inhibitors of the Anthranilyl-CoA Synthetase PqsA Block Quinolone Biosynthesis in Pseudomonas aeruginosa. ACS Chem Biol 11:3061-3067 (2016)  
Target
Name:
Anthranilate--CoA ligase
Synonyms:
Anthranilyl-CoA synthetase PqsA (PqsA) pqsA
Type:
Protein
Mol. Mass.:
56603.82
Organism:
Pseudomonas aeruginosa (Gram- Bacteria)
Description:
Residue:
517
  
Inhibitor
Name:
BDBM205460
Synonyms:
Salicyl-AMS (3)
Type:
Small organic molecule
Emp. Form.:
C17H17N6O8S
Mol. Mass.:
465.418
SMILES:
Nc1ncnc2n(cnc12)[C@@H]1O[C@H](COS(=O)(=O)[N-]C(=O)c2ccccc2O)[C@@H](O)[C@H]1O
: