Target
Inorganic pyrophosphatase
Ligand
BDBM205464
Substrate
Meas. Tech.
Colorimetric Malachite Green Assay
pH
7.5±n/a
Temperature
298.15±n/a K
IC50
2.33e+5± 1.10e+5 nM
Comments
extracted
Citation
 Pang, AHGarzan, ALarsen, MJMcQuade, TJGarneau-Tsodikova, STsodikov, OV Discovery of Allosteric and Selective Inhibitors of Inorganic Pyrophosphatase from Mycobacterium tuberculosis. ACS Chem Biol 11:3084-3092 (2016)  
Target
Name:
Inorganic pyrophosphatase
Synonyms:
IPYR_ECOLI ppa
Type:
Protein
Mol. Mass.:
19696.77
Organism:
Escherichia coli (Enterobacteria)
Description:
P0A7A9
Residue:
176
  
Inhibitor
Name:
BDBM205464
Synonyms:
PPiase inhibitor, 1
Type:
Small organic molecule
Emp. Form.:
C17H16N6
Mol. Mass.:
304.3491
SMILES:
C1CN1c1nc(nc(n1)-c1cccn1-c1ccccc1)N1CC1
: