Target
Inorganic pyrophosphatase
Ligand
BDBM205477
Substrate
Meas. Tech.
Colorimetric Malachite Green Assay
pH
7.5±n/a
Temperature
298.15±n/a K
IC50
4.92e+5± 2.18e+5 nM
Comments
extracted
Citation
 Pang, AHGarzan, ALarsen, MJMcQuade, TJGarneau-Tsodikova, STsodikov, OV Discovery of Allosteric and Selective Inhibitors of Inorganic Pyrophosphatase from Mycobacterium tuberculosis. ACS Chem Biol 11:3084-3092 (2016)  
Target
Name:
Inorganic pyrophosphatase
Synonyms:
IPYR_ECOLI ppa
Type:
Protein
Mol. Mass.:
19696.77
Organism:
Escherichia coli (Enterobacteria)
Description:
P0A7A9
Residue:
176
  
Inhibitor
Name:
BDBM205477
Synonyms:
PPiase inhibitor, 21
Type:
Small organic molecule
Emp. Form.:
C27H36N6
Mol. Mass.:
444.6149
SMILES:
Cc1cc(C)cc(c1)-n1cccc1-c1nc(nc(n1)N1CCCCCC1)N1CCCCCC1
: