Target
Inorganic pyrophosphatase
Ligand
BDBM205469
Substrate
Meas. Tech.
Colorimetric Malachite Green Assay
pH
7.5±n/a
Temperature
298.15±n/a K
IC50
3.00e+5± 1.1e+4 nM
Comments
extracted
Citation
 Pang, AHGarzan, ALarsen, MJMcQuade, TJGarneau-Tsodikova, STsodikov, OV Discovery of Allosteric and Selective Inhibitors of Inorganic Pyrophosphatase from Mycobacterium tuberculosis. ACS Chem Biol 11:3084-3092 (2016)  
Target
Name:
Inorganic pyrophosphatase
Synonyms:
IPP1 Inorganic pyrophosphatase (ScPPiase) PPA1
Type:
Protein
Mol. Mass.:
32294.13
Organism:
Saccharomyces cerevisiae (Yeast)
Description:
P00817
Residue:
287
  
Inhibitor
Name:
BDBM205469
Synonyms:
PPiase inhibitor, 13
Type:
Small organic molecule
Emp. Form.:
C27H38N6
Mol. Mass.:
446.6308
SMILES:
CCCCN(CCCC)c1nc(nc(n1)-c1cccn1-c1ccccc1)N1CCCCCC1
: