Target
Probable manganese-dependent inorganic pyrophosphatase
Ligand
BDBM205465
Substrate
Meas. Tech.
Colorimetric Malachite Green Assay
pH
7.5±n/a
Temperature
298.15±n/a K
IC50
>6.00e+5±n/a nM
Comments
extracted
Citation
 Pang, AHGarzan, ALarsen, MJMcQuade, TJGarneau-Tsodikova, STsodikov, OV Discovery of Allosteric and Selective Inhibitors of Inorganic Pyrophosphatase from Mycobacterium tuberculosis. ACS Chem Biol 11:3084-3092 (2016)  
Target
Name:
Probable manganese-dependent inorganic pyrophosphatase
Synonyms:
Inorganic pyrophosphatase (SaPPiase) ppaC
Type:
Protein
Mol. Mass.:
34052.80
Organism:
Staphylococcus aureus (Firmicutes)
Description:
Q6GFD7
Residue:
309
  
Inhibitor
Name:
BDBM205465
Synonyms:
PPiase inhibitor, 6
Type:
Small organic molecule
Emp. Form.:
C17H20N6
Mol. Mass.:
308.3809
SMILES:
CN(C)c1nc(nc(n1)-c1cccn1-c1ccccc1)N(C)C
: