Target
Poly(ADP-ribose) glycohydrolase
Ligand
BDBM205482
Substrate
Meas. Tech.
PARG Biochemical Assay
pH
7.4±n/a
IC50
>6.0e+4±n/a nM
Comments
extracted
Citation
 James, DISmith, KMJordan, AMFairweather, EEGriffiths, LAHamilton, NSHitchin, JRHutton, CPJones, SKelly, PMcGonagle, AESmall, HStowell, AITucker, JWaddell, IDWaszkowycz, BOgilvie, DJ First-in-Class Chemical Probes against Poly(ADP-ribose) Glycohydrolase (PARG) Inhibit DNA Repair with Differential Pharmacology to Olaparib. ACS Chem Biol 11:3179-3190 (2016)  
Target
Name:
Poly(ADP-ribose) glycohydrolase
Synonyms:
PARG Poly(ADP-ribose) glycohydrolase | poly(ADP-ribose) glycohydrolase (PARG)
Type:
Protein
Mol. Mass.:
111107.13
Organism:
Homo sapiens (Human)
Description:
Q86W56
Residue:
976
  
Inhibitor
Name:
BDBM205482
Synonyms:
PDD00031705 (7)
Type:
Small organic molecule
Emp. Form.:
C20H22N6O3S3
Mol. Mass.:
490.622
SMILES:
CN(C1(C)CC1)S(=O)(=O)c1ccc2n(Cc3sc(C)nc3C)c(=O)n(-c3ncns3)c2c1
: