Target
Cyclin-dependent kinase-like 2
Ligand
BDBM205483
Substrate
Meas. Tech.
Competitive Binding Assay (KINOMEscan)
Kd
5100±n/a nM
Citation
 Murphy, EACheresh, DAArnold, LD Therapeutic methods and compositions involving allosteric kinase inhibition US Patent  US9260417 Publication Date 2/16/2016 
Target
Name:
Cyclin-dependent kinase-like 2
Synonyms:
2.7.11.22 CDKL2_HUMAN Serine/threonine-protein kinase KKIAMRE
Type:
Mol. Mass.:
56031.51
Organism:
Homo sapiens (Human)
Description:
Q92772
Residue:
493
  
Inhibitor
Name:
BDBM205483
Synonyms:
US9260417, 6
Type:
Small organic molecule
Emp. Form.:
C20H16F3N7OS
Mol. Mass.:
459.448
SMILES:
CSc1nc(N)cc(Oc2ccc(cc2)-c2nnc(Nc3cccc(c3)C(F)(F)F)[nH]2)n1
: