Target
Tyrosine-protein kinase ABL1
Ligand
BDBM205483
Substrate
Meas. Tech.
Competitive Binding Assay (KINOMEscan)
Kd
>10000±n/a nM
Citation
 Murphy, EACheresh, DAArnold, LD Therapeutic methods and compositions involving allosteric kinase inhibition US Patent  US9260417 Publication Date 2/16/2016 
Target
Name:
Tyrosine-protein kinase ABL1
Synonyms:
ABL ABL1_HUMAN JTK7 Proto-oncogene tyrosine-protein kinase ABL1 Tyrosine-protein kinase ABL V-abl Abelson murine leukemia viral oncogene homolog 1 p150 | tyrosine-protein kinase ABL1 isoform a
Type:
Enzyme
Mol. Mass.:
122897.30
Organism:
Homo sapiens (Human)
Description:
P00519
Residue:
1130
  
Inhibitor
Name:
BDBM205483
Synonyms:
US9260417, 6
Type:
Small organic molecule
Emp. Form.:
C20H16F3N7OS
Mol. Mass.:
459.448
SMILES:
CSc1nc(N)cc(Oc2ccc(cc2)-c2nnc(Nc3cccc(c3)C(F)(F)F)[nH]2)n1
: