Target
Prostaglandin G/H synthase 2 [18-604,V509I]
Ligand
BDBM17638
Substrate
Meas. Tech.
COX Enzyme Inhibition Assay (Table 2)
IC50
4.5e+2±n/a nM
Citation
 Uddin, MJCrews, BCXu, SGhebreselasie, KDaniel, CKKingsley, PJBanerjee, SMarnett, LJ Antitumor Activity of Cytotoxic Cyclooxygenase-2 Inhibitors. ACS Chem Biol 11:3052-3060 (2016)  
Target
Name:
Prostaglandin G/H synthase 2 [18-604,V509I]
Synonyms:
Cox-2 Cyclooxygenase-2 mutant (V523I) Pghs-b Tis10
Type:
Protein
Mol. Mass.:
67274.22
Organism:
Mus musculus (Mouse)
Description:
Sequence based on 4OTJ
Residue:
587
  
Inhibitor
Name:
BDBM17638
Synonyms:
2-{1-[(4-chlorophenyl)carbonyl]-5-methoxy-2-methyl-1H-indol-3-yl}acetic acid Indocin US11478464, Compound Indomethacin US9271961, Indomethacin | indometacin
Type:
Small organic molecule
Emp. Form.:
C19H16ClNO4
Mol. Mass.:
357.788
SMILES:
COc1ccc2n(C(=O)c3ccc(Cl)cc3)c(C)c(CC(O)=O)c2c1
: