Target
Extracellular calcium-sensing receptor
Ligand
BDBM205515
Substrate
Meas. Tech.
Agonistic Activity Assay
pH
7.2±n/a
Temperature
310.15±n/a K
EC50
3±n/a nM
Comments
extracted
Citation
 Sugiki, MOkamatsu, TYano, TTaniguchi, S Alkylamine derivative US Patent  US9253997 Publication Date 2/9/2016 
Target
Name:
Extracellular calcium-sensing receptor
Synonyms:
CASR CaR Calcium-sensing receptor (CaSR) GPRC2A Parathyroid Cell calcium-sensing receptor Synonyms=GPRC2A | hCasR
Type:
Protein
Mol. Mass.:
120663.13
Organism:
Homo sapiens (Human)
Description:
P41180
Residue:
1078
  
Inhibitor
Name:
BDBM205515
Synonyms:
US9253997, 67
Type:
Small organic molecule
Emp. Form.:
C11H14ClN3O7S
Mol. Mass.:
367.763
SMILES:
COC(=O)[C@@H](N)CNC(=O)Nc1cc(Cl)cc(c1O)S(O)(=O)=O
: