Target
Large envelope protein
Ligand
BDBM289777
Substrate
Meas. Tech.
HBSAg ELISA assay
EC50
5.00±n/a nM
Citation
 Fu, JJin, XLee, PLu, PYoung, JM Tetracyclic pyridone compounds as antivirals US Patent  US10093673 Publication Date 10/9/2018 
Target
Name:
Large envelope protein
Synonyms:
HBSAG_HBVD3 | S
Type:
Mol. Mass.:
42772.52
Organism:
Hepatitis B virus
Description:
P03138
Residue:
389
  
Inhibitor
Name:
BDBM289777
Synonyms:
US10093673, Compound 6.1 | US10093673, Compound 6.2
Type:
Small organic molecule
Emp. Form.:
C22H25NO6
Mol. Mass.:
399.437
SMILES:
COCCCOc1cc2C3CCCC3n3cc(C(O)=O)c(=O)cc3-c2cc1OC
: