Target
Prostaglandin D2 receptor 2
Ligand
BDBM205858
Substrate
Meas. Tech.
Radioligand Displacement Assay
pH
7±n/a
Temperature
298.15±n/a K
IC50
0.2±n/a nM
Comments
extracted
Citation
 Aissaoui, HBoss, CRichard-Bildstein, SSiegrist, R Heterocyclyl derivatives and their use as prostaglandin D2 receptor modulators US Patent  US9255090 Publication Date 2/9/2016 
Target
Name:
Prostaglandin D2 receptor 2
Synonyms:
CD_antigen=CD294 Chemoattractant Receptor-homologous molecule expressed on T-helper type 2 cells (CRTH2) Chemoattractant receptor-homologous molecule expressed on Th2 cells (CRTH2) G protein-coupled receptor 44 GPR44 PTGDR2 Prostaglandin D2 receptor 2 | Prostaglandin D2 receptor 2 (PGD2)
Type:
Enzyme
Mol. Mass.:
43295.45
Organism:
Homo sapiens (Human)
Description:
Q9Y5Y4
Residue:
395
  
Inhibitor
Name:
BDBM205858
Synonyms:
US9255090, 327
Type:
Small organic molecule
Emp. Form.:
C30H29F2NO5
Mol. Mass.:
521.5518
SMILES:
CCOc1cc(CC(O)=O)ccc1-c1ccc(F)c2CCN(Cc12)C(=O)CC1CCOc2cc(F)ccc12
: