Target
Vascular endothelial growth factor receptor 2
Ligand
BDBM205987
Substrate
Meas. Tech.
VEGRR2 Kinase Assay
pH
7.4±n/a
Temperature
303.15±n/a K
IC50
7±n/a nM
Comments
extracted
Citation
 Hull, III, CEMalone, TC Substituted 1,2,3,4-tetrahydrobenzo[C][2,7] naphthyridines and derivatives thereof as kinase inhibitors US Patent  US9255096 Publication Date 2/9/2016 
Target
Name:
Vascular endothelial growth factor receptor 2
Synonyms:
CD_antigen=CD309 Fetal liver kinase 1 (FLK-1) KDR Protein-tyrosine kinase receptor Flk-1 VEGFR-2 VEGFR2 Vascular Endothelial Growth Factor Receptor Kinase 2 Vascular endothelial growth factor receptor 2 (KDR) Vascular endothelial growth factor receptor 2 (VEGFR2) Vascular endothelial growth factor receptor-2 (VEGFR-2)
Type:
Receptor Tyrosine Kinase
Mol. Mass.:
151510.97
Organism:
Homo sapiens (Human)
Description:
P35968
Residue:
1356
  
Inhibitor
Name:
BDBM205987
Synonyms:
US9255096, 3
Type:
Small organic molecule
Emp. Form.:
C26H23N3O
Mol. Mass.:
393.4803
SMILES:
Cc1cccc(NC(=O)c2cccc(c2)N2CCc3c(C2)cnc2ccccc32)c1
: