Target
Protein mono-ADP-ribosyltransferase PARP3 [R100H]
Ligand
BDBM206061
Substrate
Meas. Tech.
Enzyme Assay
IC50
66.9±n/a nM
Citation
 Zhang, AMiao, ZYe, NHuan, XSong, ZChen, CChen, YDing, J Substituted [1,2,4]triazolo[4,3-a]pyrazines as PARP-1 inhibitors US Patent  US9255106 Publication Date 2/9/2016 
Target
Name:
Protein mono-ADP-ribosyltransferase PARP3 [R100H]
Synonyms:
(ARTD3 or PARP3) ADPRT3 Human diphtheria toxin-like ADP-ribosyltransferase (ARTD3 or PARP3) PARP3_HUMAN Poly [ADP-ribose] polymerase 3 (PARP-3) | Poly(ADP-ribose) polymerase-3 (ARTD3/PARP3)
Type:
PROTEIN
Mol. Mass.:
60071.85
Organism:
Homo sapiens (Human)
Description:
Q9Y6F1[R100H]
Residue:
533
  
Inhibitor
Name:
BDBM206061
Synonyms:
US9255106, S3
Type:
Small organic molecule
Emp. Form.:
C23H18F4N6O2
Mol. Mass.:
486.4216
SMILES:
CC1CN(Cc2nnc(n12)C(F)(F)F)C(=O)c1cc(Cc2n[nH]c(=O)c3ccccc23)ccc1F
: