Target
Interleukin-1 receptor-associated kinase 1
Ligand
BDBM206105
Substrate
Meas. Tech.
In vitro IRAK-1 and IRAK-4 Assay
IC50
163±n/a nM
Citation
 Arora, NChen, SHermann, JCKuglstatter, ALabadie, SSLin, CJLucas, MCMoore, AGPapp, ETalamas, FXWanner, JZhai, Y Pyrazolo[1,5a]pyrimidine derivatives as IRAK4 modulators US Patent  US9255110 Publication Date 2/9/2016 
Target
Name:
Interleukin-1 receptor-associated kinase 1
Synonyms:
IRAK IRAK1 Interleukin-1 receptor-associated kinase 1 (IRAK-1)
Type:
Enzyme
Mol. Mass.:
76536.81
Organism:
Homo sapiens (Human)
Description:
P51617
Residue:
712
  
Inhibitor
Name:
BDBM206105
Synonyms:
US9255110, 18
Type:
Small organic molecule
Emp. Form.:
C19H19ClN4O4
Mol. Mass.:
402.832
SMILES:
OC1CCC(CC1)Oc1ccc(Cl)cc1NC(=O)c1cnn2cc(O)cnc12
: