Target
Serine/threonine-protein kinase B-raf [V600E]
Ligand
BDBM206291
Substrate
Meas. Tech.
In vitro Enzyme Assay
pH
7.5±n/a
Temperature
298.15±n/a K
IC50
>1.00e+5±n/a nM
Comments
extracted
Citation
 El-Damasy, AKSeo, SHCho, NCPae, ANKim, EEKeum, G Design and synthesis of new 2-anilinoquinolines bearing N-methylpicolinamide moiety as potential antiproliferative agents. Chem Biol Drug Des 89:98-113 (2017)  
Target
Name:
Serine/threonine-protein kinase B-raf [V600E]
Synonyms:
B-RAF V600E B-Raf Protein Kinase Mutant (V600E) BRAF BRAF mutant V600E BRAF_HUMAN Protein mono-ADP-ribosyltransferase (PARP3) RAFB1 Serine/threonine-protein kinase B-raf (V600E) V-RAF murine sarcoma viral oncogene homologue B1 mutant (BRAF V600E)
Type:
Mol. Mass.:
84474.98
Organism:
Homo sapiens (Human)
Description:
P15056 V600E
Residue:
766
  
Inhibitor
Name:
BDBM206291
Synonyms:
4-((2-((3-(Tert-butyl)phenyl)amino)quinolin-5-yl)oxy)-N-methylpicolinamide (6d)
Type:
Small organic molecule
Emp. Form.:
C26H26N4O2
Mol. Mass.:
426.5102
SMILES:
CNC(=O)c1cc(Oc2cccc3nc(Nc4cccc(c4)C(C)(C)C)ccc23)ccn1
: