Target
Coagulation factor XI
Ligand
BDBM289796
Substrate
Meas. Tech.
Factor XIa Assay
pH
7.4±n/a
Temperature
298.15±n/a K
Ki
28.1±n/a nM
Comments
extracted
Citation
 Lim, YGuo, ZAli, AEdmondson, SDLiu, WGallo-Etienne, GVWu, HGao, YStamford, AWYu, YKevin, NJAnand, RSha, DNeelamkavil, SFHussain, ZKumar, PMoningka, RDuffy, JLXu, JJiang, YChakrabarti, ASone, H Factor XIa inhibitors US Patent  US10093683 Publication Date 10/9/2018 
Target
Name:
Coagulation factor XI
Synonyms:
Coagulation factor XIa Coagulation factor XIa light chain FA11_HUMAN Factor XIa PTA | Plasma thromboplastin antecedent
Type:
Enzyme
Mol. Mass.:
70130.58
Organism:
Homo sapiens (Human)
Description:
P03951
Residue:
625
  
Inhibitor
Name:
BDBM289796
Synonyms:
Methyl(4-(((2S)-1-(6-chloro-2-oxo-1,2-dihydrospiro[benzo[d][1,3]oxazine-4,3′-pyrrolidin]-1′-yl)-3-(3-cyclopropylisoxazol-5-yl)-1-oxopropan-2-yl)carbamoyl)phenyl)carbamate | US10093683, Example 84
Type:
Small organic molecule
Emp. Form.:
C29H28ClN5O7
Mol. Mass.:
594.015
SMILES:
COC(=O)Nc1ccc(cc1)C(=O)N[C@@H](Cc1cc(no1)C1CC1)C(=O)N1CC[C@@]2(C1)OC(=O)Nc1ccc(Cl)cc21
: