Target
Coagulation factor XI
Ligand
BDBM289805
Substrate
Meas. Tech.
Factor XIa Assay
pH
7.4±n/a
Temperature
298.15±n/a K
Ki
7.51±n/a nM
Comments
extracted
Citation
 Lim, YGuo, ZAli, AEdmondson, SDLiu, WGallo-Etienne, GVWu, HGao, YStamford, AWYu, YKevin, NJAnand, RSha, DNeelamkavil, SFHussain, ZKumar, PMoningka, RDuffy, JLXu, JJiang, YChakrabarti, ASone, H Factor XIa inhibitors US Patent  US10093683 Publication Date 10/9/2018 
Target
Name:
Coagulation factor XI
Synonyms:
Coagulation factor XIa Coagulation factor XIa light chain FA11_HUMAN Factor XIa PTA | Plasma thromboplastin antecedent
Type:
Enzyme
Mol. Mass.:
70130.58
Organism:
Homo sapiens (Human)
Description:
P03951
Residue:
625
  
Inhibitor
Name:
BDBM289805
Synonyms:
US10093683, Example 116A | US10093683, Example 116B
Type:
Small organic molecule
Emp. Form.:
C28H30ClFN4O7
Mol. Mass.:
589.012
SMILES:
COC(=O)Nc1ccc(cc1)C(=O)NC(C[C@@H]1CCCO1)C(=O)N1CCC[C@@]2(C1)OC(=O)Nc1ccc(Cl)c(F)c21
: