Target
Coagulation factor XI
Ligand
BDBM289812
Substrate
Meas. Tech.
Factor XIa Assay
pH
7.4±n/a
Temperature
298.15±n/a K
Ki
5000±n/a nM
Comments
extracted
Citation
 Lim, YGuo, ZAli, AEdmondson, SDLiu, WGallo-Etienne, GVWu, HGao, YStamford, AWYu, YKevin, NJAnand, RSha, DNeelamkavil, SFHussain, ZKumar, PMoningka, RDuffy, JLXu, JJiang, YChakrabarti, ASone, H Factor XIa inhibitors US Patent  US10093683 Publication Date 10/9/2018 
Target
Name:
Coagulation factor XI
Synonyms:
Coagulation factor XIa Coagulation factor XIa light chain FA11_HUMAN Factor XIa PTA | Plasma thromboplastin antecedent
Type:
Enzyme
Mol. Mass.:
70130.58
Organism:
Homo sapiens (Human)
Description:
P03951
Residue:
625
  
Inhibitor
Name:
BDBM289812
Synonyms:
US10093683, Example 120a US10093683, Example 120c | US10093683, Example 120d
Type:
Small organic molecule
Emp. Form.:
C29H27ClN4O6
Mol. Mass.:
563.001
SMILES:
COC(=O)Nc1ccc(NC(=O)C(Cc2ccccc2)C(=O)N2CCC3(C2)OC(=O)Nc2ccc(Cl)cc32)cc1
: