Target
Coagulation factor XI
Ligand
BDBM289829
Substrate
Meas. Tech.
Factor XIa Assay
pH
7.4±n/a
Temperature
298.15±n/a K
Ki
354±n/a nM
Comments
extracted
Citation
 Lim, YGuo, ZAli, AEdmondson, SDLiu, WGallo-Etienne, GVWu, HGao, YStamford, AWYu, YKevin, NJAnand, RSha, DNeelamkavil, SFHussain, ZKumar, PMoningka, RDuffy, JLXu, JJiang, YChakrabarti, ASone, H Factor XIa inhibitors US Patent  US10093683 Publication Date 10/9/2018 
Target
Name:
Coagulation factor XI
Synonyms:
Coagulation factor XIa Coagulation factor XIa light chain FA11_HUMAN Factor XIa PTA | Plasma thromboplastin antecedent
Type:
Enzyme
Mol. Mass.:
70130.58
Organism:
Homo sapiens (Human)
Description:
P03951
Residue:
625
  
Inhibitor
Name:
BDBM289829
Synonyms:
US10093683, Example 131a US10093683, Example 131c | US10093683, Example 131d
Type:
Small organic molecule
Emp. Form.:
C29H26ClN5O5
Mol. Mass.:
560
SMILES:
COC(=O)Nc1ccc2[nH]c(nc2c1)C(Cc1ccccc1)C(=O)N1CCC2(C1)OC(=O)Nc1ccc(Cl)cc21
: