Target
Coagulation factor XI
Ligand
BDBM289847
Substrate
Meas. Tech.
Factor XIa Assay
pH
7.4±n/a
Temperature
298.15±n/a K
Ki
8750±n/a nM
Comments
extracted
Citation
 Lim, YGuo, ZAli, AEdmondson, SDLiu, WGallo-Etienne, GVWu, HGao, YStamford, AWYu, YKevin, NJAnand, RSha, DNeelamkavil, SFHussain, ZKumar, PMoningka, RDuffy, JLXu, JJiang, YChakrabarti, ASone, H Factor XIa inhibitors US Patent  US10093683 Publication Date 10/9/2018 
Target
Name:
Coagulation factor XI
Synonyms:
Coagulation factor XIa Coagulation factor XIa light chain FA11_HUMAN Factor XIa PTA | Plasma thromboplastin antecedent
Type:
Enzyme
Mol. Mass.:
70130.58
Organism:
Homo sapiens (Human)
Description:
P03951
Residue:
625
  
Inhibitor
Name:
BDBM289847
Synonyms:
(4R)-1′-((1-(3-amino-1H-indazol-6-yl)ethyl)-L-phenylalanyl)-6-chlorospiro[benzo[d][1,3]oxazine-4,3′-pyrrolidin]-2(1H)-one dihydrochloride | US10093683, Example 224
Type:
Small organic molecule
Emp. Form.:
C29H29ClN6O3
Mol. Mass.:
545.032
SMILES:
CC(N[C@@H](Cc1ccccc1)C(=O)N1CCC2(C1)OC(=O)Nc1ccc(Cl)cc21)c1ccc2c(N)n[nH]c2c1
: