Target
Coagulation factor XI
Ligand
BDBM289851
Substrate
Meas. Tech.
Factor XIa Assay
pH
7.4±n/a
Temperature
298.15±n/a K
Ki
0.700±n/a nM
Comments
extracted
Citation
 Lim, YGuo, ZAli, AEdmondson, SDLiu, WGallo-Etienne, GVWu, HGao, YStamford, AWYu, YKevin, NJAnand, RSha, DNeelamkavil, SFHussain, ZKumar, PMoningka, RDuffy, JLXu, JJiang, YChakrabarti, ASone, H Factor XIa inhibitors US Patent  US10093683 Publication Date 10/9/2018 
Target
Name:
Coagulation factor XI
Synonyms:
Coagulation factor XIa Coagulation factor XIa light chain FA11_HUMAN Factor XIa PTA | Plasma thromboplastin antecedent
Type:
Enzyme
Mol. Mass.:
70130.58
Organism:
Homo sapiens (Human)
Description:
P03951
Residue:
625
  
Inhibitor
Name:
BDBM289851
Synonyms:
2-(5-(((S)-1-((R)-6-chloro-5-fluoro-2-oxo-1,2-dihydrospiro[benzo[d][1,3]oxazine-4,3′-piperidin]-1′-yl)-3-(4-fluorophenyl)-1-oxopropan-2-yl)carbamoyl)-3-fluorothiophen-2-yl)-2-oxoacetic acid | US10093683, Example 267
Type:
Small organic molecule
Emp. Form.:
C28H21ClF3N3O7S
Mol. Mass.:
635.995
SMILES:
OC(=O)C(=O)c1sc(cc1F)C(=O)N[C@@H](Cc1ccc(F)cc1)C(=O)N1CCC[C@@]2(C1)OC(=O)Nc1ccc(Cl)c(F)c21
: