Target
Amine oxidase [flavin-containing] B
Ligand
BDBM206320
Substrate
Meas. Tech.
In vitro MAO-A/B Inhibition Assay
IC50
3.50e+5± 3.08e+4 nM
Citation
 Jia, WZCheng, FZhang, YJGe, JYYao, SQZhu, Q Rapid synthesis of flavone-based monoamine oxidase (MAO) inhibitors targeting two active sites using click chemistry. Chem Biol Drug Des 89:141-151 (2017)  
Target
Name:
Amine oxidase [flavin-containing] B
Synonyms:
AOFB_HUMAN MAOB Monoamine oxidase type B (MAO B) Monoamine oxidase type B (MAOB)
Type:
Protein
Mol. Mass.:
58768.76
Organism:
Homo sapiens (Human)
Description:
P27338
Residue:
520
  
Inhibitor
Name:
BDBM206320
Synonyms:
2-(4-chlorophenyl)-6-((4-((phenylamino)methyl)-1H-1,2,3-triazol-1-yl)methyl)-4H-chromen-4-one (Az2k17)
Type:
Small organic molecule
Emp. Form.:
C25H19ClN4O2
Mol. Mass.:
442.897
SMILES:
Clc1ccc(cc1)-c1cc(=O)c2cc(Cn3cc(CNc4ccccc4)nn3)ccc2o1
: