Target
Beta-1 adrenergic receptor
Ligand
BDBM50213108
Substrate
Meas. Tech.
Beta1-AR Binding Assay
pH
7.8±n/a
Temperature
277.15±n/a K
Ki
24956±2100 nM
Comments
extracted
Citation
 Wainer, IWBernier, MToll, LRJimenez, LA Use of fenoterol and fenoterol analogues in the treatment of glioblastomas and astrocytomas US Patent  US9492405 Publication Date 11/15/2016 
Target
Name:
Beta-1 adrenergic receptor
Synonyms:
ADRB1R, B1AR Adrb1 Adrenergic receptor beta Beta-1 adrenoreceptor adrenergic Beta1,2
Type:
Protein
Mol. Mass.:
50486.84
Organism:
Rattus norvegicus (Rat)
Description:
P18090
Residue:
466
  
Inhibitor
Name:
BDBM50213108
Synonyms:
(R,R)-(-)-5-{2-[2-(4-aminophenyl)-1-methylethylamino]-1-hydroxyethyl}-1,3-benzenediol US10617654, Compound (R,R)-3 US9492405, 9
Type:
Small organic molecule
Emp. Form.:
C17H21NO3
Mol. Mass.:
287.3535
SMILES:
C[C@H](Cc1ccccc1)NC[C@H](O)c1cc(O)cc(O)c1
: