Target
Beta-2 adrenergic receptor
Ligand
BDBM50213108
Substrate
Meas. Tech.
Beta2-AR Binding Assay
pH
7.7±n/a
Kd
2951±n/a nM
Comments
extracted
Citation
 Wainer, IWBernier, MToll, LRJimenez, LA Use of fenoterol and fenoterol analogues in the treatment of glioblastomas and astrocytomas US Patent  US9492405 Publication Date 11/15/2016 
Target
Name:
Beta-2 adrenergic receptor
Synonyms:
ADRB2 ADRB2_HUMAN Beta-2 adrenoceptor | Beta-2 adrenoreceptor
Type:
Mol. Mass.:
46461.69
Organism:
Homo sapiens (Human)
Description:
P07550
Residue:
413
  
Inhibitor
Name:
BDBM50213108
Synonyms:
(R,R)-(-)-5-{2-[2-(4-aminophenyl)-1-methylethylamino]-1-hydroxyethyl}-1,3-benzenediol US10617654, Compound (R,R)-3 US9492405, 9
Type:
Small organic molecule
Emp. Form.:
C17H21NO3
Mol. Mass.:
287.3535
SMILES:
C[C@H](Cc1ccccc1)NC[C@H](O)c1cc(O)cc(O)c1
: