Target
Casein kinase I isoform epsilon
Ligand
BDBM206917
Substrate
Meas. Tech.
In Vitro ATP-33P Casein Assay
pH
7.5±n/a
Temperature
298.15±n/a K
IC50
7±n/a nM
Comments
extracted
Citation
 Cote-Des-Combes, SFroissant, JGibert, JMarguet, FPacaud, CPuech, FRavet, A 3,4-dihydropyrrolo[1,2-A]pyrazine-2,8(1H)-dicarboxamide derivatives, preparation thereof and therapeutic use thereof for diseases involving casein kinase 1 epsilon and/or casein kinase 1 delta US Patent  US9233965 Publication Date 1/12/2016 
Target
Name:
Casein kinase I isoform epsilon
Synonyms:
Axin-1/Casein kinase I epsilon CKIe Casein kinase 1 epsilon (CK1Ɛ) Casein kinase I isoform epsilon (CK1 epsilon) Casein kinase I isoform epsilon (CK1epsilon) | KC1E_HUMAN
Type:
Protein
Mol. Mass.:
47340.25
Organism:
Homo sapiens (Human)
Description:
P49674
Residue:
416
  
Inhibitor
Name:
BDBM206917
Synonyms:
US9233965, 60
Type:
Small organic molecule
Emp. Form.:
C19H23ClN4O2
Mol. Mass.:
374.865
SMILES:
CC(C)(C)NC(=O)N1CCn2c(Cl)c(c(C(N)=O)c2C1)-c1ccccc1
: