Target
Histone deacetylase 3
Ligand
BDBM207749
Substrate
Meas. Tech.
HDAC enzyme inhibitionAssay
IC50
41±n/a nM
Citation
 Rusche, JRPeet, NPHopper, AT Compositions including 6-aminohexanoic acid derivatives as HDAC inhibitors US Patent  US9265734 Publication Date 2/23/2016 
Target
Name:
Histone deacetylase 3
Synonyms:
HD3 HDAC3_HUMAN Human HDAC3 SMAP45
Type:
Enzyme
Mol. Mass.:
48829.55
Organism:
Homo sapiens (Human)
Description:
O15379
Residue:
428
  
Inhibitor
Name:
BDBM207749
Synonyms:
US9265734, R29
Type:
Small organic molecule
Emp. Form.:
C21H23FN4O2
Mol. Mass.:
382.4313
SMILES:
Nc1ccccc1NC(=O)CCCCCNC(=O)c1cc2cccc(F)c2[nH]1
: