Target
Histone deacetylase 3
Ligand
BDBM207818
Substrate
Meas. Tech.
HDAC enzyme inhibitionAssay
IC50
45±n/a nM
Citation
 Rusche, JRPeet, NPHopper, AT Compositions including 6-aminohexanoic acid derivatives as HDAC inhibitors US Patent  US9265734 Publication Date 2/23/2016 
Target
Name:
Histone deacetylase 3
Synonyms:
HD3 HDAC3_HUMAN Human HDAC3 SMAP45
Type:
Enzyme
Mol. Mass.:
48829.55
Organism:
Homo sapiens (Human)
Description:
O15379
Residue:
428
  
Inhibitor
Name:
BDBM207818
Synonyms:
US9265734, R99
Type:
Small organic molecule
Emp. Form.:
C21H25N5O2
Mol. Mass.:
379.4555
SMILES:
Cc1ccc2[nH]nc(C(=O)NCCCCCC(=O)Nc3ccccc3N)c2c1
: