Target
Alpha-synuclein
Ligand
BDBM207879
Substrate
Meas. Tech.
In Vitro Inhibition Assay
EC50
40±n/a nM
Citation
 Griffioen, GVan Dooren, TRojas De La Parra, VAllasia, SMarchand, AKilonda, AChaltin, P Compounds for the treatment of neurodegenerative diseases US Patent  US9266832 Publication Date 2/23/2016 
Target
Name:
Alpha-synuclein
Synonyms:
NACP SNCA | SYUA_HUMAN
Type:
Protein
Mol. Mass.:
14451.42
Organism:
Homo sapiens (Human)
Description:
P37840
Residue:
140
  
Inhibitor
Name:
BDBM207879
Synonyms:
US9266832, Cpd036
Type:
Small organic molecule
Emp. Form.:
C25H23ClN2O
Mol. Mass.:
402.916
SMILES:
Cc1cccc(Cc2ccc(cc2)C(=O)NCCc2c[nH]c3ccc(Cl)cc23)c1
: