Target
Alpha-synuclein
Ligand
BDBM207897
Substrate
Meas. Tech.
In Vitro Inhibition Assay
EC50
42±n/a nM
Citation
 Griffioen, GVan Dooren, TRojas De La Parra, VAllasia, SMarchand, AKilonda, AChaltin, P Compounds for the treatment of neurodegenerative diseases US Patent  US9266832 Publication Date 2/23/2016 
Target
Name:
Alpha-synuclein
Synonyms:
NACP SNCA | SYUA_HUMAN
Type:
Protein
Mol. Mass.:
14451.42
Organism:
Homo sapiens (Human)
Description:
P37840
Residue:
140
  
Inhibitor
Name:
BDBM207897
Synonyms:
US9266832, Cpd054
Type:
Small organic molecule
Emp. Form.:
C24H20ClFN2O
Mol. Mass.:
406.88
SMILES:
Fc1ccccc1Cc1cccc(c1)C(=O)NCCc1c[nH]c2ccc(Cl)cc12
: