Target
Alpha-synuclein
Ligand
BDBM207935
Substrate
Meas. Tech.
In Vitro Inhibition Assay
EC50
76±n/a nM
Citation
 Griffioen, GVan Dooren, TRojas De La Parra, VAllasia, SMarchand, AKilonda, AChaltin, P Compounds for the treatment of neurodegenerative diseases US Patent  US9266832 Publication Date 2/23/2016 
Target
Name:
Alpha-synuclein
Synonyms:
NACP SNCA | SYUA_HUMAN
Type:
Protein
Mol. Mass.:
14451.42
Organism:
Homo sapiens (Human)
Description:
P37840
Residue:
140
  
Inhibitor
Name:
BDBM207935
Synonyms:
US9266832, Cpd092
Type:
Small organic molecule
Emp. Form.:
C23H20ClN3O
Mol. Mass.:
389.877
SMILES:
Clc1ccc2[nH]cc(CCNC(=O)c3ccc(Nc4ccccc4)cc3)c2c1
: