Target
E3 ubiquitin-protein ligase Mdm2 [1-118,T47W]
Ligand
BDBM207987
Substrate
Meas. Tech.
Microscale Thermophoresis (MT) Binding Assay
pH
7.4±n/a
Temperature
298.15±n/a K
Kd
2.6e+4± 1e+3 nM
Comments
extracted
Citation
 Surmiak, ETwarda-Clapa, AZak, KMMusielak, BTomala, MDKubica, KGrudnik, PMadej, MJablonski, MPotempa, JKalinowska-Tluscik, JDömling, ADubin, GHolak, TA A Unique Mdm2-Binding Mode of the 3-Pyrrolin-2-one- and 2-Furanone-Based Antagonists of the p53-Mdm2 Interaction. ACS Chem Biol 11:3310-3318 (2016)  
Target
Name:
E3 ubiquitin-protein ligase Mdm2 [1-118,T47W]
Synonyms:
MDM2 | MDM2_HUMAN
Type:
Protein
Mol. Mass.:
13556.52
Organism:
Homo sapiens (Human)
Description:
Mdm2 truncation (1-118 aa) with mutation at T47W
Residue:
118
  
Inhibitor
Name:
BDBM207987
Synonyms:
4-(4-chlorobenzyl)-3-(6-chloro-1H-indol-3-yl)-5-(4-fluorobenzyl)-5-hydroxy-1,5-dihydro-2H-furan-2-one (2d)
Type:
Small organic molecule
Emp. Form.:
C26H18Cl2FNO3
Mol. Mass.:
482.33
SMILES:
OC1(Cc2ccc(F)cc2)OC(=O)C(=C1Cc1ccc(Cl)cc1)c1c[nH]c2cc(Cl)ccc12
: