Target
Genome polyprotein
Ligand
BDBM208199
Substrate
Meas. Tech.
ELISA-Based Assay
IC50
1.9±n/a nM
Citation
 McComas, CCLiverton, NJHabermann, JKoch, UNarjes, FLi, PPeng, XSoll, RWu, HPalani, AHe, SDai, XLiu, HLai, ZLondon, CXiao, DZorn, NNargund, R Tetracyclic heterocycle compounds and methods of use thereof for the treatment of viral diseases US Patent  US9265773 Publication Date 2/23/2016 
Target
Name:
Genome polyprotein
Synonyms:
HCV Polymerase (S282T) NS3/4A Protein POLG_HCVJA
Type:
Protein
Mol. Mass.:
327076.78
Organism:
Hepatitis C Virus (Virus)
Description:
P26662
Residue:
3010
  
Inhibitor
Name:
BDBM208199
Synonyms:
US9265773, 144 | US9265773, 145
Type:
Small organic molecule
Emp. Form.:
C31H24FN5O5S
Mol. Mass.:
597.616
SMILES:
CNC(=O)c1c(oc2cc(N(C)S(C)(=O)=O)c(cc12)-c1cnc2OCc3c(nc4ccccn34)-c2c1)-c1ccc(F)cc1
: