Target
Genome polyprotein
Ligand
BDBM208248
Substrate
Meas. Tech.
ELISA-Based Assay
IC50
1.7±n/a nM
Citation
 McComas, CCLiverton, NJHabermann, JKoch, UNarjes, FLi, PPeng, XSoll, RWu, HPalani, AHe, SDai, XLiu, HLai, ZLondon, CXiao, DZorn, NNargund, R Tetracyclic heterocycle compounds and methods of use thereof for the treatment of viral diseases US Patent  US9265773 Publication Date 2/23/2016 
Target
Name:
Genome polyprotein
Synonyms:
HCV Polymerase (S282T) NS3/4A Protein POLG_HCVJA
Type:
Protein
Mol. Mass.:
327076.78
Organism:
Hepatitis C Virus (Virus)
Description:
P26662
Residue:
3010
  
Inhibitor
Name:
BDBM208248
Synonyms:
US9265773, 193
Type:
Small organic molecule
Emp. Form.:
C32H24F3N5O5S
Mol. Mass.:
647.624
SMILES:
CNC(=O)c1c(oc2cc(N(CCF)S(C)(=O)=O)c(cc12)-c1ncc2OCn3c(cc4c(F)cccc34)-c2n1)-c1ccc(F)cc1
: