Target
Orexin/Hypocretin receptor type 1
Ligand
BDBM208511
Substrate
Meas. Tech.
Antagonistic Activity Assay
pH
7.4±n/a
Temperature
310.15±n/a K
IC50
0.9±n/a nM
Comments
extracted
Citation
 Futamura, AAraki, YAbe, MOhta, HSuzuki, RNozawa, D Heteroaromatic methyl cyclic amine derivative US Patent  US9266870 Publication Date 2/23/2016 
Target
Name:
Orexin/Hypocretin receptor type 1
Synonyms:
HCRTR1 OX1R_HUMAN Orexin receptor type 1 (OR 1) Orexin receptor type 1 (OX1) Orexin receptor type 1 (OxR1) | Ox1r
Type:
Protein
Mol. Mass.:
47554.50
Organism:
Homo sapiens (Human)
Description:
O43613
Residue:
425
  
Inhibitor
Name:
BDBM208511
Synonyms:
US9266870, 27
Type:
Small organic molecule
Emp. Form.:
C22H20FN7O2
Mol. Mass.:
433.4383
SMILES:
Cc1ccc(c(n1)C(=O)N1CCOC1Cn1ccc(n1)-c1ccc(F)cc1)-n1nccn1
: