Target
Orexin receptor type 2
Ligand
BDBM208489
Substrate
Meas. Tech.
Antagonistic Activity Assay
pH
7.4±n/a
Temperature
310.15±n/a K
IC50
11.5±n/a nM
Comments
extracted
Citation
 Futamura, AAraki, YAbe, MOhta, HSuzuki, RNozawa, D Heteroaromatic methyl cyclic amine derivative US Patent  US9266870 Publication Date 2/23/2016 
Target
Name:
Orexin receptor type 2
Synonyms:
HCRTR2 OX2R_HUMAN Orexin receptor type 2 (OR-2) Orexin receptor type 2 (OX2R) Ox-2-R | Ox2-R
Type:
Protein
Mol. Mass.:
50710.53
Organism:
Homo sapiens (Human)
Description:
O43614
Residue:
444
  
Inhibitor
Name:
BDBM208489
Synonyms:
US9266870, 5
Type:
Small organic molecule
Emp. Form.:
C23H22FN7O2
Mol. Mass.:
447.4649
SMILES:
C[C@H]1CN([C@H](Cn2cc(cn2)-c2ccc(F)cn2)O1)C(=O)c1cc(C)ccc1-n1nccn1
: