Target
Orexin receptor type 2
Ligand
BDBM208509
Substrate
Meas. Tech.
Antagonistic Activity Assay
pH
7.4±n/a
Temperature
310.15±n/a K
IC50
107±n/a nM
Comments
extracted
Citation
 Futamura, AAraki, YAbe, MOhta, HSuzuki, RNozawa, D Heteroaromatic methyl cyclic amine derivative US Patent  US9266870 Publication Date 2/23/2016 
Target
Name:
Orexin receptor type 2
Synonyms:
HCRTR2 OX2R_HUMAN Orexin receptor type 2 (OR-2) Orexin receptor type 2 (OX2R) Ox-2-R | Ox2-R
Type:
Protein
Mol. Mass.:
50710.53
Organism:
Homo sapiens (Human)
Description:
O43614
Residue:
444
  
Inhibitor
Name:
BDBM208509
Synonyms:
US9266870, 25
Type:
Small organic molecule
Emp. Form.:
C24H19F2N5O2
Mol. Mass.:
447.4368
SMILES:
Fc1ccc(cc1)-c1cnn(CC2OCCN2C(=O)c2cc(F)ccc2-c2ncccn2)c1
: