Target
cAMP and cAMP-inhibited cGMP 3',5'-cyclic phosphodiesterase 10A
Ligand
BDBM208975
Substrate
Meas. Tech.
Fluorescence Polarization Assay
pH
7.2±n/a
Temperature
298.15±n/a K
Ki
546±n/a nM
Comments
extracted
Citation
 Barrow, JCCox, CDNolt, MBShipe, WD Triazolopyridinone PDE10 inhibitors US Patent  US9266881 Publication Date 2/23/2016 
Target
Name:
cAMP and cAMP-inhibited cGMP 3',5'-cyclic phosphodiesterase 10A
Synonyms:
3',5'-cyclic phosphodiesterase PDE10_HUMAN Phosphodiesterase 10A
Type:
Protein
Mol. Mass.:
88412.52
Organism:
Homo sapiens (Human)
Description:
Q9Y233
Residue:
779
  
Inhibitor
Name:
BDBM208975
Synonyms:
US9266881, 13-6
Type:
Small organic molecule
Emp. Form.:
C19H21N5O2
Mol. Mass.:
351.4023
SMILES:
O=c1n(C[C@@H]2C[C@H]2c2ccccn2)nc2cccc(N3CCOCC3)n12
: