Target
Insulin-degrading enzyme
Ligand
BDBM209025
Substrate
Meas. Tech.
IDE Activity Assay
IC50
>2.0e+4±n/a nM
Citation
 Liu, DRMaianti, JPSaghatelian, AKleiner, RE Macrocyclic insulin-degrading enzyme (IDE) inhibitors and uses thereof US Patent  US9243038 Publication Date 1/26/2016 
Target
Name:
Insulin-degrading enzyme
Synonyms:
Abeta-degrading protease IDE Insulin degrading enzyme (hIDE) Insulin-degrading enzyme Insulysin | insulin-degrading enzyme isoform 1 precursor
Type:
Enzyme Catalytic Domain
Mol. Mass.:
117968.59
Organism:
Homo sapiens (Human)
Description:
P14735
Residue:
1019
  
Inhibitor
Name:
BDBM209025
Synonyms:
US9243038, 5a (cis olefin) | US9243038, 5b (trans olefin)
Type:
Small organic molecule
Emp. Form.:
C41H52N6O7
Mol. Mass.:
740.8876
SMILES:
NC(=O)[C@@H]1CCCCNC(=O)[C@@H](Cc2ccc(cc2)C(=O)c2ccccc2)NC(=O)[C@H](CC2CCCCC2)NC(=O)[C@H](CC2CC2)NC(=O)\C=C\C(=O)N1
: